{"text_format":"1","workbook":"xlsx","n_sheets":21,"sheets":["Framside AUS","RENBlad Lavspent","RENBlad 1801","RENBlad 1804","RENBlad 1808","RENBlad 1809","RENBlad 1815","RENBlad 1833","RENBlad 1855","Traversskift med hjelpetravers","Skifte bendsling","Glassisolator skift","3-par stangmetoden for E-mast","AUS klasse.2 24 kV","AUS klasse.2 72,5 kV","AUS klasse.3 med teleskopmast","Tester AUS betjeningsstenger","Arbeidsplattform","Rengjøring","RENBlad 1701","D365 - vareliste"],"not_rendered":{"charts":0,"images":38,"macros":1,"external_links":0,"defined_names":0,"comments":4,"pivot_tables":0},"unopened":[],"bounds":{"document_bytes":16777216,"sheet_cells":100000,"rows_first":2000,"rows_last":500,"rows_between":2000,"halvings":0,"cell_chars":16384,"cell_head_chars":4096},"cells_cut":0,"cells_raw":0,"read":"whole","date_system":"1900"}

{"sheet":"Framside AUS","index":0,"n_rows":3,"n_cols":18,"rows_kept":3,"cut":false,"hidden":false,"merged":[[2,0,3,12],[2,13,3,19],[0,5,0,14]]}
[null,null,null,null,null,"Framside AUS produktvelger",null,null,null,null,null,null,null,null,null,null,null,"GUHU Versjon 1.0"]
[]
["Arbeidsprosedyrer for høyspent og lavspent",null,null,null,null,null,null,null,null,null,null,null,null,"Annet"]

{"sheet":"RENBlad Lavspent","index":1,"n_rows":43,"n_cols":7,"rows_kept":43,"cut":false,"hidden":false,"merged":[]}
["Posisjon ","Navn ","Antall ","Enhet ","Spesifikasjon ","Maks belastning [kN] / kommentar","Elnummer"]
[null,"Isolerende hansker",null,"stk.",null,"Isolerende hansker | Melbye AS"]
[null,"E-shark hjelmer",null,"stk.",null,"E.shark hjelmer | Melbye AS"]
[null,"Isolerende utstyr 1000 V",null,"stk.",null,"Isolerende utstyr 1000 V | Melbye AS"]
[null,"1000V Tildekningssett for linjer",null,"stk.",null,null,8880180]
[null,"Faseslange 1kV AUS utstyr 1m lang",null,"stk.",null,null,8880163]
[null,"Faseslange 1kV AUS utstyr 1,5m lang",null,"stk.",null,null,8880164]
[null,"Faseslange 1kV AUS utstyr 3m lang",null,"stk.",null,null,8880165]
[null,"Isolerende matte 1kV AUS utstyr med borrelås 0,66 x 0,36m",null,"stk.",null,null,8880159]
[null,"Isolerende matte 1kV AUS utstyr med borrelås 0,5 x 0,9m",null,"stk.",null,null,8880161]
{"$rows_left_out":34}
{"sheet":"RENBlad 1801","index":2,"n_rows":38,"n_cols":7,"rows_kept":38,"cut":false,"hidden":false,"merged":[]}
["Posisjon ","Navn ","Antall ","Enhet ","Spesifikasjon ","Maks belastning [kN] / kommentar","Elnummer"]
[1,"L.L =Lineløfter (dim 6 cm) ","1","stk. ","490 cm ",2.4,8871136]
[1,"L.L =Lineløfter (dim 6 cm) ",1,"stk. ","420 cm ",3,8871136]
[1,"L.L =Lineløfter (dim 6 cm) ",1,"stk. ","420 / 360 cm ","3,00 / 3,85 ",8871137]
[2,"L.H =Lineholder (dim 4 cm) ","2","stk. ","360 / 300 cm ","6,7 (strekk) 1,00 / 1,12 (trykk)",8871141]
[2,"L.H =Lineholder  (dim 4 cm) ","1","stk. ","300 cm ","6,7 (strekk)  1,12 (trykk) ",8871141]
[null,"Stangisolator med klemme (3,8 cm) ",3,"stk. ","120 cm ",17.7,8871147]
[3,"Sadel for lineløfter og lineholder uten forlenger ","3","stk. ",null,4.4000000000000004,"8871151/8871155"]
[4,"Sadel for lineløfter og lineholder med forlenger ","3","stk. ",null,3.5,"8871153/8871162"]
[null,"Sadel med taufester ",1,"stk. ",null,4.4000000000000004,8852520]
{"$rows_left_out":29}
{"sheet":"RENBlad 1804","index":3,"n_rows":37,"n_cols":7,"rows_kept":37,"cut":false,"hidden":false,"merged":[]}
["Posisjon ","Navn ","Antall ","Enhet ","Spesifikasjon ","Maks belastning [kN] / kommentar","Elnummer"]
[1,"Hjelpetravers 3 meter lang for en lineløfter",1,"stk.","300 cm ",3.85,8871159]
[1,"Isolatorer med smekk klemme eller trinseklemme ",1,"stk.",null,null,8871185]
[null,"Stigbøyle med bøylefeste",2,"stk.",null,null,8871157]
[2,"L.L =Lineløfter (dim 6 cm) ",1,"stk. ","420 cm ",3,8871136]
[3,"L.L =Lineløfter (dim 6 cm) ",1,"stk. ","490 cm ",2.4,8871136]
[4,"L.H =Lineholder (dim 4 cm) ",1,"stk.","300 cm","6,7 (strekk) 1,12 (trykk) ",8871141]
[5,"Sadel fjærbelastet låseanordning med gaffel",1,"stk.",null,null,8871198]
[6,"Sadel for lineløfter m/ forlenger (6 cm) ",1,"stk.",null,3.5,8871162]
[7,"Sadel for lineløfter og lineholder med forlenger ",1,"stk. ",null,3.5,"8871153/8871162"]
{"$rows_left_out":28}
{"sheet":"RENBlad 1808","index":4,"n_rows":23,"n_cols":7,"rows_kept":23,"cut":false,"hidden":false,"merged":[]}
["Posisjon ","Navn ","Antall ","Enhet ","Spesifikasjon ","Maks belastning [kN] / kommentar","Elnummer"]
[1,"Isolerskjerm for stolper 1,80m - 30cm i diameter 36,6 kV - hardplast",2,"stk. ","Glatt",null,8880183]
[2,"Isolerskjerm for stolper 1,80m - 23cm i diameter 36,6 kV - hardplast",2,"stk. ","Med \"spor\"",null,8880184]
[2,"Isolerskjerm for stolper 1,80m - 30cm i diameter 36,6 kV - hardplast",2,"stk. ","Med \"spor\"",null,8880185]
[3,"Stolpelås for isolerskjerm for stolper",1,"stk. ",null,null,8872610]
[null,"Sikkerhetsmerke ","1 (2) ","stk. ",null,null,"Teip/Borrelås etc."]
[null,"Isolerskjermer til travers ","3","stk. ","Hardplast",null,8871222]
[null,"Tildekning for piggisolator 26,4 kV AUS utstyr - hardplast","3","stk. ","Hardplast","Alternativt for mer tildekning",8871226]
[null,"Tildekning for piggisolator 36,6 kV AUS utstyr - hardplast","3","stk. ","Hardplast","Alternativt for mer tildekning",8871221]
[null,"Faseslange 1,5m 26,4 kV med feste for klostang - hardplast","3/6","stk. ","Hardplast","Alternativt for mer tildekning",8880191]
{"$rows_left_out":14}
{"sheet":"RENBlad 1809","index":5,"n_rows":38,"n_cols":7,"rows_kept":38,"cut":false,"hidden":false,"merged":[]}
["Posisjon ","Navn ","Antall ","Enhet ","Spesifikasjon ","Maks belastning [kN] / kommentar","Elnummer"]
[1,"L.L =Lineløfter (dim 6 cm) ",1,"stk. ","490 cm ",2.4,8871136]
[1,"L.L =Lineløfter (dim 6 cm) ",1,"stk. ","420 cm ",3,8871136]
[1,"L.L =Lineløfter (dim 6 cm) ",1,"stk. ","420 / 360 cm ","3,00 / 3,85 ",8871137]
[2,"L.H =Lineholder (dim 4 cm) ",1,"stk. ","360 / 300 cm ","6,7 (strekk) 1,00 / 1,12 (trykk)",8871141]
[2,"L.H =Lineholder  (dim 4 cm) ",2,"stk. ","300 cm ","6,7 (strekk)  1,12 (trykk) ",8871141]
[3,"Stangisolator med klemme (3,8 cm) ",3,"stk. ","120 cm ",17.7,8871147]
[5,"Sadel for lineløfter og lineholder uten forlenger ",4,"stk. ",null,4.4000000000000004,"8871151/8871155"]
[4,"Sadel for lineløfter og lineholder med forlenger ",2,"stk. ",null,3.5,"8871153/8871162"]
[null,"Sadel med taufester ",1,"stk. ",null,4.4000000000000004,8852520]
{"$rows_left_out":29}
{"sheet":"RENBlad 1815","index":6,"n_rows":37,"n_cols":7,"rows_kept":37,"cut":false,"hidden":false,"merged":[]}
["Posisjon ","Navn ","Antall ","Enhet ","Spesifikasjon ","Maks belastning [kN] / kommentar","Elnummer"]
[1,"Hjelpetravers 3 meter lang for en lineløfter",1,"stk.","300 cm ",3.85,8871159]
[null,"T-klemme med isolator",1,"stk.",null,null,8871166]
[null,"Stigbøyle med bøylefeste",2,"stk.",null,null,8871157]
[2,"L.L =Lineløfter (dim 6 cm) ",1,"stk.","4,90 / 420 cm ","2,40/3,00 ",8871136]
[3,"L.H =Lineholder (dim 4 cm) ",2,"stk.","300 cm","6,7 (strekk) 1,12 (trykk) ",8871141]
[4,"Sadel for lineløfter m/ forlenger (6 cm) ",2,"stk.",null,3.5,8871162]
[5,"Tautalje ",1,"stk.",null,5,8871154]
[6,"Isolatorer med smekk klemme eller trinseklemme ",3,"stk.",null,null,8871185]
[null,"Lineholder med trinse uten feste",3,"stk.",null,"Alternativt med trinse",9303610]
{"$rows_left_out":28}
{"sheet":"RENBlad 1833","index":7,"n_rows":24,"n_cols":7,"rows_kept":24,"cut":false,"hidden":false,"merged":[]}
["Posisjon ","Navn ","Antall ","Enhet ","Spesifikasjon ","Maks belastning [kN] / kommentar","Elnummer"]
["1,2,3,4,5","Teleskopmast",1,"stk. ",null,2.5,9300335]
[6,"Sikkerhetsmerke ","1 (2) ","stk. ",null,null,"Teip/Borrelås etc."]
[7,"Isolerskjermer til travers ","3","stk. ","Hardplast",null,8871222]
[null,"Tildekning for piggisolator 26,4 kV AUS utstyr - hardplast","3","stk. ","Hardplast","Alternativt for mer tildekning",8871226]
[null,"Tildekning for piggisolator 36,6 kV AUS utstyr - hardplast","3","stk. ","Hardplast","Alternativt for mer tildekning",8871221]
[null,"Faseslange 1,5m 26,4 kV med feste for klostang - hardplast","3/6","stk. ","Hardplast","Alternativt for mer tildekning",8880191]
[null,"Hel isolerduk med 6 hull 36 kV AUS utstyr - gummi","2/3","stk. ","Gummi","Alternativt mot hardplast",8870970]
[null,"Splitt isolerduk med 28 hull 36 kV AUS utstyr - gummi","1/2","stk. ","Gummi","Alternativt mot hardplast",8870971]
[null,"Roterende krok med ABC feste","1","stk. ","Sette på matter","Alternativt mot hardplast",8871184]
{"$rows_left_out":15}
{"sheet":"RENBlad 1855","index":8,"n_rows":18,"n_cols":7,"rows_kept":18,"cut":false,"hidden":false,"merged":[]}
["Posisjon ","Navn ","Antall ","Enhet ","Spesifikasjon ","Maks belastning [kN] / kommentar","Elnummer"]
[null,"Universal verktøystang ",2,"stk. ",null,null,"8871095/8871149"]
[null,"AUS målestang - teleskopstang 1,7m-10,6m med metrisk skala",1,"stk. ",null,null,8870931]
[null,"Klostang ",1,"stk. ",null,null,"8871064/8871100/8871125"]
[null,"Pipestang tilpasset momentnøkkel maks 100Nm",1,"stk. ",null,null,8871110]
[null,"Sikkerhetsmerke ","1 (2) ","stk. ",null,null,"Teip/Borrelås etc."]
[null,"Skralle med 1/2\" firkantfeste med ABC feste",1,"stk. ",null,null,8871023]
[null,"Fleksibel pipeholder med 1/2\" firkantfeste med fjær med ABC feste",1,"stk. ",null,null,8871102]
[null,"Arbeidsplattform i epoxyglass 2,4 meter lang",null,"stk. ",null,null,8853416]
[null,"Rekkverk for plattform - benyttes med elnummer 8853416",null,"stk. ",null,null,8853408]
{"$rows_left_out":9}
{"sheet":"Traversskift med hjelpetravers","index":9,"n_rows":25,"n_cols":4,"rows_kept":25,"cut":false,"hidden":false,"merged":[]}
[null,null,null,"Traversskift med hjelpetravers"]
[]
["Pos.","Ant.","El. nr.","Type"]
[null,1,8871064,{"$f":"VLOOKUP(C4,'D365 - vareliste'!A:C,2,FALSE)","v":"Teleskopklostang 1,66m - 2,44m allsidig for fleste AUS utstyr"}]
[null,1,8871100,{"$f":"VLOOKUP(C5,'D365 - vareliste'!A:C,2,FALSE)","v":"Teleskopklostang 2,57m - 4,25m allsidig for fleste AUS utstyr"}]
[null,1,8852520,{"$f":"VLOOKUP(C6,'D365 - vareliste'!A:C,2,FALSE)","v":"Sadel fjærbelastet låseanordning for taufester"}]
[null,1,8871154,{"$f":"VLOOKUP(C7,'D365 - vareliste'!A:C,2,FALSE)","v":"Tautalje med doble blokker med polypropylen tau 12mm"}]
[null,1,8871147,{"$f":"VLOOKUP(C8,'D365 - vareliste'!A:C,2,FALSE)","v":"Stangisolator 38cm lang med krok og øye"}]
[null,2,8871162,{"$f":"VLOOKUP(C9,'D365 - vareliste'!A:C,2,FALSE)","v":"Sadel fjærbelastet låseanordning for lineløfter med forlenger"}]
[null,1,8871163,{"$f":"VLOOKUP(C10,'D365 - vareliste'!A:C,2,FALSE)","v":"Stangklemme for lineløfter med 2-sidig gaffel"}]
{"$rows_left_out":16}
{"sheet":"Skifte bendsling","index":10,"n_rows":14,"n_cols":4,"rows_kept":14,"cut":false,"hidden":false,"merged":[]}
[null,null,null,"Skifte bendsling"]
[]
["Pos.","Ant.","El. nr.","Type"]
[null,1,8871189,{"$f":"VLOOKUP(C4,'D365 - vareliste'!A:C,2,FALSE)","v":"Kuttesaks med håndtak 1,8m lang, manuell betjening"}]
[null,1,8871093,{"$f":"VLOOKUP(C5,'D365 - vareliste'!A:C,2,FALSE)","v":"Kuttesaks med håndtak 2,4m lang, manuell betjening"}]
[null,1,8871149,{"$f":"VLOOKUP(C6,'D365 - vareliste'!A:C,2,FALSE)","v":"Universal verktøystang 2,5 m ABC feste i begge ender"}]
[null,1,8871095,{"$f":"VLOOKUP(C7,'D365 - vareliste'!A:C,2,FALSE)","v":"Universal verktøystang 3,75 m ABC feste i begge ender"}]
[null,1,8871109,{"$f":"VLOOKUP(C8,'D365 - vareliste'!A:C,2,FALSE)","v":"Roterende bendsleblad for bendslinger med ABC feste"}]
[null,1,8871119,{"$f":"VLOOKUP(C9,'D365 - vareliste'!A:C,2,FALSE)","v":"X-bendsleblad for bendslinger med ABC feste"}]
[null,1,8871023,{"$f":"VLOOKUP(C10,'D365 - vareliste'!A:C,2,FALSE)","v":"Skralle med 1/2\" firkantfeste med ABC feste"}]
{"$rows_left_out":5}
{"sheet":"Glassisolator skift","index":11,"n_rows":18,"n_cols":4,"rows_kept":18,"cut":false,"hidden":false,"merged":[]}
[null,null,null,"Glassisolator skift"]
[]
["Pos.","Ant.","El. nr.","Type"]
[null,1,8871064,{"$f":"VLOOKUP(C4,'D365 - vareliste'!A:C,2,FALSE)","v":"Teleskopklostang 1,66m - 2,44m allsidig for fleste AUS utstyr"}]
[null,1,8871100,{"$f":"VLOOKUP(C5,'D365 - vareliste'!A:C,2,FALSE)","v":"Teleskopklostang 2,57m - 4,25m allsidig for fleste AUS utstyr"}]
[null,1,8871149,{"$f":"VLOOKUP(C6,'D365 - vareliste'!A:C,2,FALSE)","v":"Universal verktøystang 2,5 m ABC feste i begge ender"}]
[null,1,8871095,{"$f":"VLOOKUP(C7,'D365 - vareliste'!A:C,2,FALSE)","v":"Universal verktøystang 3,75 m ABC feste i begge ender"}]
[null,1,8871184,{"$f":"VLOOKUP(C8,'D365 - vareliste'!A:C,2,FALSE)","v":"Roterende krok med ABC feste"}]
[null,2,8870970,{"$f":"VLOOKUP(C9,'D365 - vareliste'!A:C,2,FALSE)","v":"Hel isolerduk med 6 hull 36 kV AUS utstyr - gummi"}]
[null,2,8870971,{"$f":"VLOOKUP(C10,'D365 - vareliste'!A:C,2,FALSE)","v":"Splitt isolerduk med 28 hull 36 kV AUS utstyr - gummi"}]
{"$rows_left_out":9}
{"sheet":"3-par stangmetoden for E-mast","index":12,"n_rows":34,"n_cols":4,"rows_kept":34,"cut":false,"hidden":false,"merged":[]}
[null,null,null,"3-par stangmetoden for E-mast"]
[]
["Pos.","Ant.","El.nr.","Type"]
[null,3,8871141,{"$f":"VLOOKUP(C4,'D365 - vareliste'!A:C,2,FALSE)","v":"Lineholder 3 meter lang"}]
[null,1,8871192,{"$f":"VLOOKUP(C5,'D365 - vareliste'!A:C,2,FALSE)","v":"Lineløfter 3,25 meter lang"}]
[null,1,8871137,{"$f":"VLOOKUP(C6,'D365 - vareliste'!A:C,2,FALSE)","v":"Lineløfter 3,85 meter lang"}]
[null,1,8871136,{"$f":"VLOOKUP(C7,'D365 - vareliste'!A:C,2,FALSE)","v":"Lineløfter 4,47 meter lang"}]
[null,1,8871139,{"$f":"VLOOKUP(C8,'D365 - vareliste'!A:C,2,FALSE)","v":"Lineløfter 5,25 meter lang To-delt"}]
[null,2,8871151,{"$f":"VLOOKUP(C9,'D365 - vareliste'!A:C,2,FALSE)","v":"Sadel fjærbelastet låseanordning for lineholder uten forlenger"}]
[null,1,8871155,{"$f":"VLOOKUP(C10,'D365 - vareliste'!A:C,2,FALSE)","v":"Sadel fjærbelastet låseanordning for lineløfter uten forlenger"}]
{"$rows_left_out":25}
{"sheet":"AUS klasse.2 24 kV","index":13,"n_rows":38,"n_cols":4,"rows_kept":38,"cut":false,"hidden":false,"merged":[]}
[null,null,null,"AUS Klasse.2 24 kV"]
[]
["Pos.","Ant.","El. nr.","Type"]
[null,1,8871100,{"$f":"VLOOKUP(C4,'D365 - vareliste'!A:C,2,FALSE)","v":"Teleskopklostang 2,57m - 4,25m allsidig for fleste AUS utstyr"}]
[null,1,8871092,{"$f":"VLOOKUP(C5,'D365 - vareliste'!A:C,2,FALSE)","v":"Linegriper 3,4 meter lang for å holde fast lederen"}]
[null,1,8871210,{"$f":"VLOOKUP(C6,'D365 - vareliste'!A:C,2,FALSE)","v":"Kuttesaks med jekk håndtak 2,4m lang, manuell betjening"}]
[null,1,8871095,{"$f":"VLOOKUP(C7,'D365 - vareliste'!A:C,2,FALSE)","v":"Universal verktøystang 3,75 m ABC feste i begge ender"}]
[null,1,8871111,{"$f":"VLOOKUP(C8,'D365 - vareliste'!A:C,2,FALSE)","v":"Pipenøkkelstang med 1/2\" firkantfeste på begge ender"}]
[null,3,8871174,{"$f":"VLOOKUP(C9,'D365 - vareliste'!A:C,2,FALSE)","v":"Futteral 2650 x 150 mm"}]
[null,1,8871175,{"$f":"VLOOKUP(C10,'D365 - vareliste'!A:C,2,FALSE)","v":"Futteral 3400 x 200 mm"}]
{"$rows_left_out":29}
{"sheet":"AUS klasse.2 72,5 kV","index":14,"n_rows":27,"n_cols":4,"rows_kept":27,"cut":false,"hidden":false,"merged":[]}
[null,null,null,"AUS Klasse.2 72,5 kV"]
[]
["Pos.","Ant.","El. nr.","Type"]
[null,1,8871092,{"$f":"VLOOKUP(C4,'D365 - vareliste'!A:C,2,FALSE)","v":"Linegriper 3,4 meter lang for å holde fast lederen"}]
[null,1,8870900,"Faseslange 1,3m 72,5 kV AUS utstyr - hardplast"]
[null,1,8871210,{"$f":"VLOOKUP(C6,'D365 - vareliste'!A:C,2,FALSE)","v":"Kuttesaks med jekk håndtak 2,4m lang, manuell betjening"}]
[null,1,8871095,{"$f":"VLOOKUP(C7,'D365 - vareliste'!A:C,2,FALSE)","v":"Universal verktøystang 3,75 m ABC feste i begge ender"}]
[null,1,8871111,{"$f":"VLOOKUP(C8,'D365 - vareliste'!A:C,2,FALSE)","v":"Pipenøkkelstang med 1/2\" firkantfeste på begge ender"}]
[null,3,8871174,{"$f":"VLOOKUP(C9,'D365 - vareliste'!A:C,2,FALSE)","v":"Futteral 2650 x 150 mm"}]
[null,1,8871175,{"$f":"VLOOKUP(C10,'D365 - vareliste'!A:C,2,FALSE)","v":"Futteral 3400 x 200 mm"}]
{"$rows_left_out":18}
{"sheet":"AUS klasse.3 med teleskopmast","index":15,"n_rows":41,"n_cols":6,"rows_kept":41,"cut":false,"hidden":false,"merged":[]}
[null,null,null,"AUS klasse 3"]
[]
[null,null,"Redusert  verktøyliste ved bruk av teleskopmast og topptravers"]
["Pos.","Ant.","El.nr.","Type"]
[null,1,8871115,{"$f":"VLOOKUP(C5,'D365 - vareliste'!A:C,2,FALSE)","v":"Pipenøkkelstang med vinkelhode med 1/2\" firkantfeste"},null,"Tildekningsutstyr må vurderes"]
[null,1,8871111,{"$f":"VLOOKUP(C6,'D365 - vareliste'!A:C,2,FALSE)","v":"Pipenøkkelstang med 1/2\" firkantfeste på begge ender"},null,"Tildekningsutstyr | Melbye As"]
[null,3,8871149,{"$f":"VLOOKUP(C7,'D365 - vareliste'!A:C,2,FALSE)","v":"Universal verktøystang 2,5 m ABC feste i begge ender"}]
[null,1,8871189,{"$f":"VLOOKUP(C8,'D365 - vareliste'!A:C,2,FALSE)","v":"Kuttesaks med håndtak 1,8m lang, manuell betjening"},null,"Tildekningsutstyr - tilbehør må vurderes"]
[null,2,8871136,{"$f":"VLOOKUP(C9,'D365 - vareliste'!A:C,2,FALSE)","v":"Lineløfter 4,47 meter lang"},null,"Tildekningsutstyr - Tilbehør | Melbye AS"]
[null,1,8871151,{"$f":"VLOOKUP(C10,'D365 - vareliste'!A:C,2,FALSE)","v":"Sadel fjærbelastet låseanordning for lineholder uten forlenger"}]
{"$rows_left_out":32}
{"sheet":"Tester AUS betjeningsstenger","index":16,"n_rows":4,"n_cols":4,"rows_kept":4,"cut":false,"hidden":false,"merged":[]}
[null,null,null,"Tester for AUS betjeningsstenger og tau iht. IEC 60855-1 (100kV-30cm)"]
[]
["Pos.","Ant.","El.nr.","Type"]
[1,1,8874025,{"$f":"VLOOKUP(C4,'D365 - vareliste'!A:C,2,FALSE)","v":"Tester for AUS betjeningsstenger og tau iht. IEC 60855-1 (100kV-30cm)"}]

{"sheet":"Arbeidsplattform","index":17,"n_rows":5,"n_cols":4,"rows_kept":5,"cut":false,"hidden":false,"merged":[]}
[null,null,null,"Arbeidsplattform i epoxyglass 2,4 meter lang"]
[]
["Pos.","Ant.","El.nr.","Type"]
[1,1,8853416,{"$f":"VLOOKUP(C4,'D365 - vareliste'!A:C,2,FALSE)","v":"Arbeidsplattform i epoxyglass 2,4 meter lang"}]
[2,1,8853408,{"$f":"VLOOKUP(C5,'D365 - vareliste'!A:C,2,FALSE)","v":"Rekkverk for plattform - benyttes med elnummer 8853416"}]

{"sheet":"Rengjøring","index":18,"n_rows":10,"n_cols":4,"rows_kept":10,"cut":false,"hidden":false,"merged":[]}
[null,null,null,"Rengjøring av AUS produkter og utstyr"]
[]
["Pos.","Ant.","El.nr.","Type"]
[null,1,1835693,{"$f":"VLOOKUP(C4,'D365 - vareliste'!A:C,2,FALSE)","v":"Renseserviett 30stk i eske for isolerstenger og AUS utstyr"}]
[null,1,1835696,{"$f":"VLOOKUP(C5,'D365 - vareliste'!A:C,2,FALSE)","v":"Renseserviett 72stk i dispenser boks for rengjøring av AUS utstyr"}]
[null,1,1835697,{"$f":"VLOOKUP(C6,'D365 - vareliste'!A:C,2,FALSE)","v":"Rensespray for rengjøring av AUS utstyr"}]
[null,1,1835698,{"$f":"VLOOKUP(C7,'D365 - vareliste'!A:C,2,FALSE)","v":"Påfyll flaske 3,8 liter for rensespray"}]
[null,1,1835699,{"$f":"VLOOKUP(C8,'D365 - vareliste'!A:C,2,FALSE)","v":"Påfyll spann 18,9 liter for rensespray"}]
[]
[null,null,null,"Rengjøring for AUS utstyr | Melbye AS"]
{"$rows_left_out":1}
{"sheet":"RENBlad 1701","index":19,"n_rows":1,"n_cols":3,"rows_kept":1,"cut":false,"hidden":false,"merged":[]}
[null,null,"Hva er AUS og fordelene? Barrierer? Periodisk test? Oppbevaring og transport? Se utdrag på denne siden:"]

{"sheet":"D365 - vareliste","index":20,"n_rows":164,"n_cols":3,"rows_kept":164,"cut":false,"hidden":true,"merged":[]}
["Varenummer","Beskrivelse","Leverandørens varenummer"]
[112358,"Shunt kabel 24V - 250 A","S11272P500"]
[112359,"Shunt TF klemme - 400 A","C6001743"]
[112360,"Shunt pinnekontakt for TF klemme C-Type I-A-5 1.50\"","C6002607"]
[115587,"AUS plattform feste passer 1,8m / 2,4m plattform","C4021173"]
[115588,"Strekkavlaster 69 kV 1,67 - 1,8 meter lang","C4000575"]
[115589,"Tautalje med 2-skåret/3-skåret blokk og polypropylen tau 12 mm","C4000915"]
[115590,"Linegriper 2,4 meter lang for å holde fast lederen","C4033069"]
[115591,"Sadel med løftearm singel type","M4760W"]
[115592,"Pipenøkkelstang med vinkelhode med 1/2\" firkantfeste 3 meter lang","C4030186"]
{"$rows_left_out":154}